Target
Polyunsaturated fatty acid 5-lipoxygenase
Ligand
BDBM24554
Substrate
BDBM22319
Meas. Tech.
Determination of 5-LO Product Formation in Intact Cells (EC50/IC50)
pH
7.4±n/a
Temperature
310.15±n/a K
EC50
2600±n/a nM
Citation
 Werz, OGreiner, CKoeberle, AHoernig, CGeorge, SPopescu, LSyha, ISchubert-Zsilavecz, MSteinhilber, D Novel and potent inhibitors of 5-lipoxygenase product synthesis based on the structure of pirinixic acid. J Med Chem 51:5449-53 (2008)  
Target
Name:
Polyunsaturated fatty acid 5-lipoxygenase
Synonyms:
5-LO 5-Lipoxygenase (5-LO) 5-Lipoygenase ALOX5 LOG5 | LOX5_HUMAN
Type:
Enzyme
Mol. Mass.:
77972.74
Organism:
Homo sapiens (Human)
Description:
Recombinant protein was purified from E. coli lysate. After ammonium sulfate precipitation and subsequent steps, the supernatant (S100) was used for 5-LO activity assay.
Residue:
674
  
Inhibitor
Name:
BDBM24554
Synonyms:
Pirinixic acid-based compound, 2c | ethyl 2-{[4-chloro-6-(quinolin-6-ylamino)pyrimidin-2-yl]sulfanyl}acetate
Type:
Small organic molecule
Emp. Form.:
C17H15ClN4O2S
Mol. Mass.:
374.845
SMILES:
CCOC(=O)CSc1nc(Cl)cc(Nc2ccc3ncccc3c2)n1
:
Substrate
Name:
BDBM22319
Synonyms:
(5Z,8Z,11Z,14Z)-icosa-5,8,11,14-tetraenoic acid Arachidonic acid (AA) [1-14C]Arachidonic acid
Type:
Unsaturated fatty acid
Emp. Form.:
C20H32O2
Mol. Mass.:
304.4669
SMILES:
CCCCC\C=C/C\C=C/C\C=C/C\C=C/CCCC(O)=O
: