Target
Toll-like receptor 8
Ligand
BDBM380607
Substrate
Meas. Tech.
Pharmacological Assay
EC50
2.00±n/a nM
Citation
 Hoves, SKoerner, MWang, LYun, HZhu, WZhang, W Benzazepine sulfonamide compounds US Patent  US9890124 Publication Date 2/13/2018 
Target
Name:
Toll-like receptor 8
Synonyms:
CD_antigen: CD288 TLR8_HUMAN | TRL8
Type:
Enzyme
Mol. Mass.:
119828.77
Organism:
Homo sapiens (Human)
Description:
Q9NR97
Residue:
1041
  
Inhibitor
Name:
BDBM380607
Synonyms:
2-Amino-8-[3-[3-(hydroxymethyl)azetidin-1-yl]sulfonylphenyl]-N,N-dipropyl-3H-1-benzazepine-4-carboxamide | US9890124, 16
Type:
Small organic molecule
Emp. Form.:
C27H34N4O4S
Mol. Mass.:
510.648
SMILES:
CCCN(CCC)C(=O)C1=Cc2ccc(cc2N=C(N)C1)-c1cccc(c1)S(=O)(=O)N1CC(CO)C1
: