Target
Fibroblast growth factor receptor 2
Ligand
BDBM261924
Substrate
Meas. Tech.
FGFR Enzymatic Assay 1
IC50
<10±n/a nM
Citation
 Lu, LShen, BSokolsky, AWang, XWu, LYao, WYe, Y Bicyclic heterocycles as FGFR4 inhibitors US Patent  US9708318 Publication Date 7/18/2017 
Target
Name:
Fibroblast growth factor receptor 2
Synonyms:
BEK FGFR-2 FGFR2 Fibroblast growth factor receptor 2 (FGFR2) KGFR Keratinocyte growth factor receptor VEGF-receptor 2 and Fibroblast growth factor receptor 2
Type:
Enzyme
Mol. Mass.:
92015.45
Organism:
Homo sapiens (Human)
Description:
P21802
Residue:
821
  
Inhibitor
Name:
BDBM261924
Synonyms:
2-(5-(3-(2,6-difluoro-3,5-dimethoxyphenyl)-1-ethyl-2-oxo-1,2,3,4-tetrahydropyrido[4,3-d]pyrimidin-7-yl)pyridin-2-yl)-2-methylpropanenitrile US10632126, Example 26 US9708318, 26
Type:
Small organic molecule
Emp. Form.:
C26H25F2N5O3
Mol. Mass.:
493.5052
SMILES:
CCN1C(=O)N(Cc2cnc(cc12)-c1ccc(nc1)C(C)(C)C#N)c1c(F)c(OC)cc(OC)c1F
: