Target
Fibroblast growth factor receptor 4
Ligand
BDBM261924
Substrate
Meas. Tech.
FGFR Enzymatic Assay 1
IC50
20±n/a nM
Citation
 Lu, LShen, BSokolsky, AWang, XWu, LYao, WYe, Y Bicyclic heterocycles as FGFR4 inhibitors US Patent  US9708318 Publication Date 7/18/2017 
Target
Name:
Fibroblast growth factor receptor 4
Synonyms:
CD_antigen: CD334 FGFR4 FGFR4 Fibroblast growth factor receptor JK2 TKF
Type:
Protein
Mol. Mass.:
87957.45
Organism:
Homo sapiens (Human)
Description:
P22455
Residue:
802
  
Inhibitor
Name:
BDBM261924
Synonyms:
2-(5-(3-(2,6-difluoro-3,5-dimethoxyphenyl)-1-ethyl-2-oxo-1,2,3,4-tetrahydropyrido[4,3-d]pyrimidin-7-yl)pyridin-2-yl)-2-methylpropanenitrile US10632126, Example 26 US9708318, 26
Type:
Small organic molecule
Emp. Form.:
C26H25F2N5O3
Mol. Mass.:
493.5052
SMILES:
CCN1C(=O)N(Cc2cnc(cc12)-c1ccc(nc1)C(C)(C)C#N)c1c(F)c(OC)cc(OC)c1F
: