Target
Bromodomain-containing protein 2
Ligand
BDBM380670
Substrate
Meas. Tech.
In-Vitro Binding Assay
IC50
<11.0±n/a nM
Citation
 Blank, JBold, GCotesta, SGuagnano, VRueeger, HVaupel, A Imidazopyrrolidine derivatives and their use in the treatment of disease US Patent  US9890166 Publication Date 2/13/2018 
Target
Name:
Bromodomain-containing protein 2
Synonyms:
BRD2 Bromodomain and extra-terminal motif (BET) Bromodomain-containing protein 2 (BRD2) RING3
Type:
Protein
Mol. Mass.:
88085.95
Organism:
Homo sapiens (Human)
Description:
P25440
Residue:
801
  
Inhibitor
Name:
BDBM380670
Synonyms:
6-(4-chlorophenyl)-2-cyclopropyl-5-(3,8-dimethyl-[1,2,4]triazolo[4,3-a]pyridin-6-yl)-1-methyl-5,6-dihydropyrrolo[3,4-d]imidazol-4(1H)-one | US9890166, Example 57
Type:
Small organic molecule
Emp. Form.:
C23H21ClN6O
Mol. Mass.:
432.905
SMILES:
Cc1nnc2c(C)cc(cn12)N1C(c2c(nc(C3CC3)n2C)C1=O)c1ccc(Cl)cc1
: