Target
Bromodomain-containing protein 3
Ligand
BDBM380685
Substrate
Meas. Tech.
In-Vitro Binding Assay
IC50
<11.0±n/a nM
Citation
 Blank, JBold, GCotesta, SGuagnano, VRueeger, HVaupel, A Imidazopyrrolidine derivatives and their use in the treatment of disease US Patent  US9890166 Publication Date 2/13/2018 
Target
Name:
Bromodomain-containing protein 3
Synonyms:
BRD3 Bromodomain and extra-terminal motif (BET) Bromodomain-containing protein 3 (BRD3) RING3-like protein | RING3L
Type:
Protein
Mol. Mass.:
79571.81
Organism:
Homo sapiens (Human)
Description:
Q15059
Residue:
726
  
Inhibitor
Name:
BDBM380685
Synonyms:
N-(tert-butyl)-4-(6-(4-chlorophenyl)-5-(3,8-dimethyl-[1,2,4]triazolo[4,3-a]pyridin-6-yl)-1-isopropyl-4-oxo-1,4,5,6-tetrahydropyrrolo[3,4-d]imidazol-2-yl)-5,6-dihydropyridine-1(2H)-carboxamide | US9890166, Example 72
Type:
Small organic molecule
Emp. Form.:
C32H37ClN8O2
Mol. Mass.:
601.142
SMILES:
CC(C)n1c(nc2C(=O)N(C(c12)c1ccc(Cl)cc1)c1cc(C)c2nnc(C)n2c1)C1=CCN(CC1)C(=O)NC(C)(C)C
: