Target
Bromodomain-containing protein 3
Ligand
BDBM380699
Substrate
Meas. Tech.
In-Vitro Binding Assay
IC50
<11.0±n/a nM
Citation
 Blank, JBold, GCotesta, SGuagnano, VRueeger, HVaupel, A Imidazopyrrolidine derivatives and their use in the treatment of disease US Patent  US9890166 Publication Date 2/13/2018 
Target
Name:
Bromodomain-containing protein 3
Synonyms:
BRD3 Bromodomain and extra-terminal motif (BET) Bromodomain-containing protein 3 (BRD3) RING3-like protein | RING3L
Type:
Protein
Mol. Mass.:
79571.81
Organism:
Homo sapiens (Human)
Description:
Q15059
Residue:
726
  
Inhibitor
Name:
BDBM380699
Synonyms:
6-(4-chlorophenyl)-5-(3,8-dimethyl-[1,2,4]triazolo[4,3-a]pyridin-6-yl)-1-isopropyl-2-(tetrahydro-2H-pyran-4-yl)-5,6-dihydropyrrolo[3,4-d]imidazol-4(1H)-one | US9890166, Example 86
Type:
Small organic molecule
Emp. Form.:
C27H29ClN6O2
Mol. Mass.:
505.011
SMILES:
CC(C)n1c(nc2C(=O)N(C(c12)c1ccc(Cl)cc1)c1cc(C)c2nnc(C)n2c1)C1CCOCC1
: