Target
Bromodomain-containing protein 2
Ligand
BDBM380731
Substrate
Meas. Tech.
In-Vitro Binding Assay
IC50
14.0±n/a nM
Citation
 Blank, JBold, GCotesta, SGuagnano, VRueeger, HVaupel, A Imidazopyrrolidine derivatives and their use in the treatment of disease US Patent  US9890166 Publication Date 2/13/2018 
Target
Name:
Bromodomain-containing protein 2
Synonyms:
BRD2 Bromodomain and extra-terminal motif (BET) Bromodomain-containing protein 2 (BRD2) RING3
Type:
Protein
Mol. Mass.:
88085.95
Organism:
Homo sapiens (Human)
Description:
P25440
Residue:
801
  
Inhibitor
Name:
BDBM380731
Synonyms:
(R)-6-(4-chlorophenyl)-5-(3,7-dimethyl-3H-benzo[d][1,2,3]triazol-5-yl)-3-isopropyl-2-methyl-5,6-dihydropyrrolo[3,4-d]imidazol-4(3H)-one | US9890166, Example 118
Type:
Small organic molecule
Emp. Form.:
C23H23ClN6O
Mol. Mass.:
434.921
SMILES:
CC(C)n1c(C)nc2[C@H](N(C(=O)c12)c1cc(C)c2nnn(C)c2c1)c1ccc(Cl)cc1
: