Target
Bromodomain-containing protein 3
Ligand
BDBM380750
Substrate
Meas. Tech.
In-Vitro Binding Assay
IC50
11.0±n/a nM
Citation
 Blank, JBold, GCotesta, SGuagnano, VRueeger, HVaupel, A Imidazopyrrolidine derivatives and their use in the treatment of disease US Patent  US9890166 Publication Date 2/13/2018 
Target
Name:
Bromodomain-containing protein 3
Synonyms:
BRD3 Bromodomain and extra-terminal motif (BET) Bromodomain-containing protein 3 (BRD3) RING3-like protein | RING3L
Type:
Protein
Mol. Mass.:
79571.81
Organism:
Homo sapiens (Human)
Description:
Q15059
Residue:
726
  
Inhibitor
Name:
BDBM380750
Synonyms:
6-(4-chlorophenyl)-5-(3,7-dimethyl-3H-[1,2,3]triazolo[4,5-b]pyridin-5-yl)-1-isopropyl-2-(6-methoxypyridin-3-yl)-5,6-dihydropyrrolo[3,4-d]imidazol-4(1H)-one | US9890166, Example 138
Type:
Small organic molecule
Emp. Form.:
C27H25ClN8O2
Mol. Mass.:
528.993
SMILES:
COc1ccc(cn1)-c1nc2C(=O)N(C(c2n1C(C)C)c1ccc(Cl)cc1)c1cc(C)c2nnn(C)c2n1
: