Target
Bromodomain-containing protein 2
Ligand
BDBM380763
Substrate
Meas. Tech.
In-Vitro Binding Assay
IC50
14.0±n/a nM
Citation
 Blank, JBold, GCotesta, SGuagnano, VRueeger, HVaupel, A Imidazopyrrolidine derivatives and their use in the treatment of disease US Patent  US9890166 Publication Date 2/13/2018 
Target
Name:
Bromodomain-containing protein 2
Synonyms:
BRD2 Bromodomain and extra-terminal motif (BET) Bromodomain-containing protein 2 (BRD2) RING3
Type:
Protein
Mol. Mass.:
88085.95
Organism:
Homo sapiens (Human)
Description:
P25440
Residue:
801
  
Inhibitor
Name:
BDBM380763
Synonyms:
(R)-6-(4-chlorophenyl)-5-(3-(difluoromethyl)-8-methyl-[1,2,4]triazolo[4,3-a]pyridin-6-yl)-1-isopropyl-2-(2-methoxypyridin-3-yl)-5,6-dihydropyrrolo[3,4-d]imidazol-4(1H)-one | US9890166, Example 151
Type:
Small organic molecule
Emp. Form.:
C28H24ClF2N7O2
Mol. Mass.:
563.986
SMILES:
COc1ncccc1-c1nc2C(=O)N([C@@H](c2n1C(C)C)c1ccc(Cl)cc1)c1cc(C)c2nnc(C(F)F)n2c1
: