Target
Urease subunit alpha/beta/gamma
Ligand
BDBM24969
Substrate
BDBM24961
Meas. Tech.
Enzyme Inhibition Assay
pH
7±n/a
Temperature
303.15±n/a K
Ki
170±20 nM
IC50
1800±100 nM
Citation
 Vassiliou, SGrabowiecka, AKosikowska, PYiotakis, AKafarski, PBerlicki, L Design, synthesis, and evaluation of novel organophosphorus inhibitors of bacterial ureases. J Med Chem 51:5736-44 (2008)  
Target
Name:
Urease subunit alpha/beta/gamma
Synonyms:
Urea Amidohydrolase | Urease
Type:
Heterotrimer of ureA, ureB and ureC subunits. Three heterotrimers associate to form the active enzyme.
Mol. Mass.:
Description:
Components:
This complex has 3 components.
Component 1
Name:
Urease subunit alpha
Synonyms:
URE1_SPOPA Urease | ureC
Type:
Enzyme Subunit
Mol. Mass.:
61384.55
Organism:
Bacillus pasteurii
Description:
Residue:
569
  
Component 2
Name:
Urease subunit beta
Synonyms:
URE2_SPOPA ureB
Type:
Enzyme Subunit
Mol. Mass.:
13952.35
Organism:
Bacillus pasteurii
Description:
Residue:
126
  
Component 3
Name:
Urease subunit gamma
Synonyms:
URE3_SPOPA ureA
Type:
Enzyme Subunit
Mol. Mass.:
11143.34
Organism:
Bacillus pasteurii
Description:
Residue:
100
  
Inhibitor
Name:
BDBM24969
Synonyms:
[(2-{[(benzyloxy)carbonyl]amino}acetamido)methyl](methyl)sulfanylidenephosphinous acid | thiophosphinic acid derivative, 24
Type:
Small organic molecule
Emp. Form.:
C12H17N2O4PS
Mol. Mass.:
316.313
SMILES:
CP(O)(=S)CNC(=O)CNC(=O)OCc1ccccc1
:
Substrate
Name:
BDBM24961
Synonyms:
Urea
Type:
Small organic molecule
Emp. Form.:
CH4N2O
Mol. Mass.:
60.0553
SMILES:
NC(N)=O
: