Target
Serine/threonine-protein kinase 3
Ligand
BDBM25017
Substrate
MBP
Meas. Tech.
Kinase Inhibition Assay
pH
7.5±n/a
Temperature
295.15±n/a K
IC50
860±28 nM
Citation
 Sapkota, GPCummings, LNewell, FSArmstrong, CBain, JFrodin, MGrauert, MHoffmann, MSchnapp, GSteegmaier, MCohen, PAlessi, DR BI-D1870 is a specific inhibitor of the p90 RSK (ribosomal S6 kinase) isoforms in vitro and in vivo. Biochem J 401:29-38 (2007)  
Target
Name:
Serine/threonine-protein kinase 3
Synonyms:
KRS1 MST2 STE20-Like Kinase MST2 STK3_HUMAN Serine/threonine-protein kinase 3 (MST2) Serine/threonine-protein kinase Krs-1 | Serine/threonine-protein kinase MST2
Type:
Serine/threonine-protein kinase
Mol. Mass.:
56284.87
Organism:
Homo sapiens (Human)
Description:
Residue:
491
  
Inhibitor
Name:
BDBM25017
Synonyms:
2-[(3,5-difluoro-4-hydroxyphenyl)amino]-5,7-dimethyl-8-(3-methylbutyl)-5,6,7,8-tetrahydropteridin-6-one US11851436, Compound BI-D1870
Type:
Small organic molecule
Emp. Form.:
C19H23F2N5O2
Mol. Mass.:
391.415
SMILES:
CC(C)CCN1C(C)C(=O)N(C)c2cnc(Nc3cc(F)c(O)c(F)c3)nc12
:
Substrate
Name:
MBP
Synonyms:
Type:
Other Protein Type
Mol. Mass.:
358.43
Organism:
Description:
Residue:
3
NA