Target
Serine/threonine-protein kinase PLK2
Ligand
BDBM25115
Substrate
Biotinylated PLKtide
Meas. Tech.
PLK Kinase Assay
pH
7.5±n/a
Temperature
295.15±n/a K
Ki
>20000±n/a nM
Km
2000±n/a nM
Citation
 Johnson, EFStewart, KDWoods, KWGiranda, VLLuo, Y Pharmacological and functional comparison of the polo-like kinase family: insight into inhibitor and substrate specificity. Biochemistry 46:9551-63 (2007)  
Target
Name:
Serine/threonine-protein kinase PLK2
Synonyms:
PLK2 Polo-Like Kinase 2 Serine/threonine-protein kinase PLK2 Serum-inducible kinase
Type:
Serine/threonine-protein kinase
Mol. Mass.:
78259.87
Organism:
Homo sapiens (Human)
Description:
Full-length human PLK2 was expressed as GST-fusion protein using baculovirus expression system. GST-PLK2 was purified by using glutathione sepharose chromatography.
Residue:
685
  
Inhibitor
Name:
BDBM25115
Synonyms:
3-[(4-bromo-2,6-difluorophenyl)methoxy]-5-({[4-(pyrrolidin-1-yl)butyl]carbamoyl}amino)-1,2-thiazole-4-carboxamide CP 547632 US9446026, 1
Type:
Small organic molecule
Emp. Form.:
C20H24BrF2N5O3S
Mol. Mass.:
532.402
SMILES:
NC(=O)c1c(NC(=O)NCCCCN2CCCC2)snc1OCc1c(F)cc(Br)cc1F
:
Substrate
Name:
Biotinylated PLKtide
Synonyms:
Type:
Peptide
Mol. Mass.:
1447.52
Organism:
Description:
Residue:
13
EVIEASFAEQEAK