Target
Transthyretin
Ligand
BDBM58032
Substrate
Meas. Tech.
The FP assay
IC50
586±n/a nM
Citation
 Graef, IAAlhamadsheh, MM Identification of stabilizers of multimeric proteins US Patent  US10278929 Publication Date 5/7/2019 
Target
Name:
Transthyretin
Synonyms:
ATTR Prealbumin TTHY_HUMAN Transthyretin (TTR)
Type:
Enzyme
Mol. Mass.:
15884.31
Organism:
Homo sapiens (Human)
Description:
P02766
Residue:
147
  
Inhibitor
Name:
BDBM58032
Synonyms:
2-(1,3-Dioxo-indan-2-yl)-2-(2-methyl-1H-indol-3-yl)-malononitrile 2-(1,3-dioxo-2-indenyl)-2-(2-methyl-1H-indol-3-yl)propanedinitrile 2-[1,3-bis(oxidanylidene)inden-2-yl]-2-(2-methyl-1H-indol-3-yl)propanedinitrile SMR000416004 cid_582632
Type:
Small organic molecule
Emp. Form.:
C21H13N3O2
Mol. Mass.:
339.3468
SMILES:
Cc1[nH]c2ccccc2c1C(C#N)(C#N)C1C(=O)c2ccccc2C1=O
: