Target
Histone deacetylase 1
Ligand
BDBM25233
Substrate
Fluor de Lys-H4-AcK16
Meas. Tech.
HDAC Activity Assay
pH
8±n/a
Temperature
295.15±n/a K
IC50
10±n/a nM
Citation
 Andrews, DMGibson, KMGraham, MAMatusiak, ZSRoberts, CAStokes, ESBrady, MCChresta, CM Design and campaign synthesis of pyridine-based histone deacetylase inhibitors. Bioorg Med Chem Lett 18:2525-9 (2008)  
Target
Name:
Histone deacetylase 1
Synonyms:
Cereblon/Histone deacetylase 1 HDAC1 Histone deacetylase 1 (HDAC1) RPD3L1
Type:
Enzyme
Mol. Mass.:
55090.27
Organism:
Homo sapiens (Human)
Description:
Q13547
Residue:
482
  
Inhibitor
Name:
BDBM25233
Synonyms:
N-(2-aminophenyl)-4-[5-(azetidin-1-ylmethyl)-3-cyanopyridin-2-yl]benzamide | aminomethylpyridine-based compound, 13b
Type:
Small organic molecule
Emp. Form.:
C23H21N5O
Mol. Mass.:
383.4457
SMILES:
Nc1ccccc1NC(=O)c1ccc(cc1)-c1ncc(CN2CCC2)cc1C#N
:
Substrate
Name:
Fluor de Lys-H4-AcK16
Synonyms:
Biomol KI-174 | acetylated histone H4 lysine-16
Type:
fluorogenic, acetylated peptide substrate
Mol. Mass.:
1841.13
Organism:
Description:
It is based on residues from histone H4 (12-16).
Residue:
17
LYSGLYGLYALALYSAC