Target
Epoxide hydrolase B
Ligand
BDBM25735
Substrate
BDBM25726
Meas. Tech.
Mtb EHB Inhibition Assay
pH
7±n/a
Temperature
303.15±n/a K
IC50
16700±n/a nM
Citation
 Biswal, BKMorisseau, CGaren, GCherney, MMGaren, CNiu, CHammock, BDJames, MN The molecular structure of epoxide hydrolase B from Mycobacterium tuberculosis and its complex with a urea-based inhibitor. J Mol Biol 381:897-912 (2008)  
Target
Name:
Epoxide hydrolase B
Synonyms:
EPHB_MYCTO Mtb EHB
Type:
Enzyme
Mol. Mass.:
39285.78
Organism:
Mycobacterium tuberculosis
Description:
The His6-tagged Mtb EHB was expressed in E. coli and purified.
Residue:
356
  
Inhibitor
Name:
BDBM25735
Synonyms:
6-[(adamantan-1-ylcarbamoyl)amino]hexanoic acid Urea-based compound, 16
Type:
Small organic molecule
Emp. Form.:
C17H28N2O3
Mol. Mass.:
308.4158
SMILES:
OC(=O)CCCCCNC(=O)NC12CC3CC(CC(C3)C1)C2
:
Substrate
Name:
BDBM25726
Synonyms:
2-(6-methoxynaphthalen-2-yl)-2-({[(3-phenyloxiran-2-yl)methoxy]carbonyl}oxy)acetonitrile cyano(6-methoxy-naphthalen-2-yl)methyl trans-[(3-phenyloxiran-2-yl)methyl] carbonate
Type:
Small organic molecule
Emp. Form.:
C23H19NO5
Mol. Mass.:
389.4007
SMILES:
COc1ccc2cc(ccc2c1)C(OC(=O)OCC1OC1c1ccccc1)C#N
: