Target
Epoxide hydrolase B
Ligand
BDBM25742
Substrate
BDBM25726
Meas. Tech.
Mtb EHB Inhibition Assay
pH
7±n/a
Temperature
303.15±n/a K
IC50
2060±n/a nM
Citation
 Biswal, BKMorisseau, CGaren, GCherney, MMGaren, CNiu, CHammock, BDJames, MN The molecular structure of epoxide hydrolase B from Mycobacterium tuberculosis and its complex with a urea-based inhibitor. J Mol Biol 381:897-912 (2008)  
Target
Name:
Epoxide hydrolase B
Synonyms:
EPHB_MYCTO Mtb EHB
Type:
Enzyme
Mol. Mass.:
39285.78
Organism:
Mycobacterium tuberculosis
Description:
The His6-tagged Mtb EHB was expressed in E. coli and purified.
Residue:
356
  
Inhibitor
Name:
BDBM25742
Synonyms:
1-[4-(4-fluorophenoxy)cyclohexyl]-3-[4-(trifluoromethoxy)phenyl]urea | Urea-based compound, 23
Type:
Small organic molecule
Emp. Form.:
C20H20F4N2O3
Mol. Mass.:
412.378
SMILES:
Fc1ccc(OC2CCC(CC2)NC(=O)Nc2ccc(OC(F)(F)F)cc2)cc1
:
Substrate
Name:
BDBM25726
Synonyms:
2-(6-methoxynaphthalen-2-yl)-2-({[(3-phenyloxiran-2-yl)methoxy]carbonyl}oxy)acetonitrile cyano(6-methoxy-naphthalen-2-yl)methyl trans-[(3-phenyloxiran-2-yl)methyl] carbonate
Type:
Small organic molecule
Emp. Form.:
C23H19NO5
Mol. Mass.:
389.4007
SMILES:
COc1ccc2cc(ccc2c1)C(OC(=O)OCC1OC1c1ccccc1)C#N
: