Target
Bifunctional dihydrofolate reductase-thymidylate synthase
Ligand
BDBM25825
Substrate
BDBM18044
Meas. Tech.
DHFR Inhibition Assay
pH
7±n/a
Temperature
298.15±n/a K
IC50
16±2 nM
Citation
 Bolstad, DBBolstad, ESFrey, KMWright, DLAnderson, AC Structure-based approach to the development of potent and selective inhibitors of dihydrofolate reductase from cryptosporidium. J Med Chem 51:6839-52 (2008)  
Target
Name:
Bifunctional dihydrofolate reductase-thymidylate synthase
Synonyms:
ChDHFR-TS | Dihydrofolate Reductase (DHFR)
Type:
Enzyme
Mol. Mass.:
60186.98
Organism:
Cryptosporidium hominis
Description:
ChDHFR-TS was expressed in E. coli and purified using a methotrexate agarose column.
Residue:
521
  
Inhibitor
Name:
BDBM25825
Synonyms:
5-(3-{4-[2,6-bis(propan-2-yl)phenyl]-3-methoxyphenyl}but-1-yn-1-yl)-6-methylpyrimidine-2,4-diamine | propargyl-based inhibitor, 17d (+/-)
Type:
Small organic molecule
Emp. Form.:
C28H34N4O
Mol. Mass.:
442.5958
SMILES:
COc1cc(ccc1-c1c(cccc1C(C)C)C(C)C)C(C)C#Cc1c(C)nc(N)nc1N
:
Substrate
Name:
BDBM18044
Synonyms:
(2S)-2-[(4-{[(2-amino-4-oxo-1,4,7,8-tetrahydropteridin-6-yl)methyl]amino}phenyl)formamido]pentanedioic acid dihydrofolic acid
Type:
Small organic molecule
Emp. Form.:
C19H21N7O6
Mol. Mass.:
443.4133
SMILES:
Nc1nc2NCC(CNc3ccc(cc3)C(=O)N[C@@H](CCC(O)=O)C(O)=O)=Nc2c(=O)[nH]1
: