Target
Carbonic anhydrase 9
Ligand
BDBM25896
Substrate
BDBM10856
Meas. Tech.
CA Inhibition Assay
Ki
18±n/a nM
Citation
 Temperini, CInnocenti, AScozzafava, ASupuran, CT Carbonic anhydrase inhibitors. Interaction of the antitumor sulfamate EMD 486019 with twelve mammalian carbonic anhydrase isoforms: Kinetic and X-ray crystallographic studies. Bioorg Med Chem Lett 18:4282-6 (2008)  
Target
Name:
Carbonic anhydrase 9
Synonyms:
CA-IX CAH9_HUMAN Carbonic anhydrase 9 (CA IX) Carbonic anhydrase 9 precursor Carbonic anhydrase IX (CAIX) Carbonic anhydrases; II & IX MN RCC-associated antigen G250
Type:
Enzyme
Mol. Mass.:
49669.03
Organism:
Homo sapiens (Human)
Description:
Catalytic domain of human cloned isozyme was used in the assay
Residue:
459
  
Inhibitor
Name:
BDBM25896
Synonyms:
EMD 486019 | [2-(cycloheptylmethyl)-1,1-dioxo--benzothiophen-6-yl] sulfamate
Type:
Small organic molecule
Emp. Form.:
C16H21NO5S2
Mol. Mass.:
371.472
SMILES:
NS(=O)(=O)Oc1ccc2C=C(CC3CCCCCC3)S(=O)(=O)c2c1
:
Substrate
Name:
BDBM10856
Synonyms:
Carbon Dioxide | methanedione
Type:
Small organic molecule
Emp. Form.:
CO2
Mol. Mass.:
44.0095
SMILES:
O=C=O
: