Target
Carbonic anhydrase 6
Ligand
BDBM25904
Substrate
BDBM10856
Meas. Tech.
CA Inhibition Assay
Ki
2650±n/a nM
Citation
 Güzel, OInnocenti, AScozzafava, ASalman, AParkkila, SHilvo, MSupuran, CT Carbonic anhydrase inhibitors: synthesis and inhibition studies against mammalian isoforms I-XV with a series of 2-(hydrazinocarbonyl)-3-substituted-phenyl-1H-indole-5-sulfonamides. Bioorg Med Chem 16:9113-20 (2008)  
Target
Name:
Carbonic anhydrase 6
Synonyms:
CA-VI CAH6_HUMAN Carbonic Anhydrase VI Carbonic anhydrase 6 Carbonic anhydrase 6 (CA-VI) Salivary carbonic anhydrase | Secreted carbonic anhydrase
Type:
Enzyme
Mol. Mass.:
35371.40
Organism:
Homo sapiens (Human)
Description:
P23280
Residue:
308
  
Inhibitor
Name:
BDBM25904
Synonyms:
2-(hydrazinecarbonyl)-3-phenyl-1H-indole-5-sulfonamide CHEMBL262628 | indole sulfonamide, L
Type:
Small organic molecule
Emp. Form.:
C15H14N4O3S
Mol. Mass.:
330.362
SMILES:
NNC(=O)c1[nH]c2ccc(cc2c1-c1ccccc1)S(N)(=O)=O
:
Substrate
Name:
BDBM10856
Synonyms:
Carbon Dioxide | methanedione
Type:
Small organic molecule
Emp. Form.:
CO2
Mol. Mass.:
44.0095
SMILES:
O=C=O
: