Target
Interleukin-1 receptor-associated kinase 4
Ligand
BDBM384550
Substrate
Meas. Tech.
Kinase Assay
IC50
5.00±n/a nM
Citation
 Altman, MDBrubaker, JDChilders, MLDonofrio, AFischmann, TGibeau, CRKattar, SDLesburg, CALim, JMaclean, JKMansoor, UFNorthrup, ABSanders, JMSmith, GF Inhibitors of IRAK4 activity US Patent  US9932350 Publication Date 4/3/2018 
Target
Name:
Interleukin-1 receptor-associated kinase 4
Synonyms:
IRAK-4 IRAK4_HUMAN Interleukin-1 receptor-associated kinase 4 (IRAK4) | Renal carcinoma antigen NY-REN-64
Type:
Protein
Mol. Mass.:
51519.08
Organism:
Homo sapiens (Human)
Description:
Q9NWZ3
Residue:
460
  
Inhibitor
Name:
BDBM384550
Synonyms:
US9932350, 2-2
Type:
Small organic molecule
Emp. Form.:
C18H23BrN4O
Mol. Mass.:
391.305
SMILES:
Brc1ccc2ncnc(N[C@H]3CC[C@@H](CC3)N3CCOCC3)c2c1
: