Target
Interleukin-1 receptor-associated kinase 4
Ligand
BDBM384559
Substrate
Meas. Tech.
Kinase Assay
IC50
15.0±n/a nM
Citation
 Altman, MDBrubaker, JDChilders, MLDonofrio, AFischmann, TGibeau, CRKattar, SDLesburg, CALim, JMaclean, JKMansoor, UFNorthrup, ABSanders, JMSmith, GF Inhibitors of IRAK4 activity US Patent  US9932350 Publication Date 4/3/2018 
Target
Name:
Interleukin-1 receptor-associated kinase 4
Synonyms:
IRAK-4 IRAK4_HUMAN Interleukin-1 receptor-associated kinase 4 (IRAK4) | Renal carcinoma antigen NY-REN-64
Type:
Protein
Mol. Mass.:
51519.08
Organism:
Homo sapiens (Human)
Description:
Q9NWZ3
Residue:
460
  
Inhibitor
Name:
BDBM384559
Synonyms:
6-bromo-7-fluoro-N- [trans-4-(morpholin-4- yl)cyclohexyl]quinazolin- 4-amine | US9932350, 2-11
Type:
Small organic molecule
Emp. Form.:
C18H22BrFN4O
Mol. Mass.:
409.296
SMILES:
Fc1cc2ncnc(N[C@H]3CC[C@@H](CC3)N3CCOCC3)c2cc1Br
: