Target
Interleukin-1 receptor-associated kinase 4
Ligand
BDBM384593
Substrate
Meas. Tech.
Kinase Assay
IC50
8.00±n/a nM
Citation
 Altman, MDBrubaker, JDChilders, MLDonofrio, AFischmann, TGibeau, CRKattar, SDLesburg, CALim, JMaclean, JKMansoor, UFNorthrup, ABSanders, JMSmith, GF Inhibitors of IRAK4 activity US Patent  US9932350 Publication Date 4/3/2018 
Target
Name:
Interleukin-1 receptor-associated kinase 4
Synonyms:
IRAK-4 IRAK4_HUMAN Interleukin-1 receptor-associated kinase 4 (IRAK4) | Renal carcinoma antigen NY-REN-64
Type:
Protein
Mol. Mass.:
51519.08
Organism:
Homo sapiens (Human)
Description:
Q9NWZ3
Residue:
460
  
Inhibitor
Name:
BDBM384593
Synonyms:
4-({trans-4-[2- (fluoromethyl)morpholin- 4- yl]cyclohexyl}amino) quinazoline-6-carbonitrile | US9932350, 3-27
Type:
Small organic molecule
Emp. Form.:
C20H24FN5O
Mol. Mass.:
369.4359
SMILES:
FCC1CN(CCO1)[C@H]1CC[C@@H](CC1)Nc1ncnc2ccc(cc12)C#N
: