Target
Interleukin-1 receptor-associated kinase 4
Ligand
BDBM384613
Substrate
Meas. Tech.
Kinase Assay
IC50
9.00±n/a nM
Citation
 Altman, MDBrubaker, JDChilders, MLDonofrio, AFischmann, TGibeau, CRKattar, SDLesburg, CALim, JMaclean, JKMansoor, UFNorthrup, ABSanders, JMSmith, GF Inhibitors of IRAK4 activity US Patent  US9932350 Publication Date 4/3/2018 
Target
Name:
Interleukin-1 receptor-associated kinase 4
Synonyms:
IRAK-4 IRAK4_HUMAN Interleukin-1 receptor-associated kinase 4 (IRAK4) | Renal carcinoma antigen NY-REN-64
Type:
Protein
Mol. Mass.:
51519.08
Organism:
Homo sapiens (Human)
Description:
Q9NWZ3
Residue:
460
  
Inhibitor
Name:
BDBM384613
Synonyms:
4-({trans-4-[4- (mopholin-4- ylmethyl)piperidin-1- yl]cyclohexyl}amino) quinazoline-6-carbonitrile | US9932350, 3-43
Type:
Small organic molecule
Emp. Form.:
C25H34N6O
Mol. Mass.:
434.5771
SMILES:
N#Cc1ccc2ncnc(N[C@H]3CC[C@@H](CC3)N3CCC(CN4CCOCC4)CC3)c2c1
: