Target
Tyrosine-protein kinase receptor TYRO3
Ligand
BDBM246852
Substrate
Meas. Tech.
TAM Enzymatic Assay
Temperature
298.15±n/a K
IC50
300±n/a nM
Comments
extracted
Citation
 Li, YBurns, DM Fused bicyclic 1,2,4-triazine compounds as TAM inhibitors US Patent  US9708333 Publication Date 7/18/2017 
Target
Name:
Tyrosine-protein kinase receptor TYRO3
Synonyms:
BYK RSE TIF TYRO3_HUMAN | Tyrosine-protein kinase SKY
Type:
Protein
Mol. Mass.:
96894.13
Organism:
Homo sapiens (Human)
Description:
Q06418
Residue:
890
  
Inhibitor
Name:
BDBM246852
Synonyms:
((2R,5S)-5-{2-[(1R)- 1-hydroxyethyl]-1H- imidazo[4,5- d]thieno[3,2- b]pyridin-1- yl}tetrahydro-2H- pyran-2- yl)acetonitrile US10065963, Compound 1 US10370387, Example 20 US10519163, Example 1 US11084822, Example 1 US11161855, Example 20 US11324749, Comp. No. 5 US11596632, Comp. No. 5 US9732097, Example 1 US9908895, Example 20
Type:
Small organic molecule
Emp. Form.:
C17H18N4O2S
Mol. Mass.:
342.415
SMILES:
C[C@@H](O)c1nc2cnc3ccsc3c2n1[C@H]1CC[C@H](CC#N)OC1
: