Target
Mitogen-activated protein kinase 14
Ligand
BDBM25979
Substrate
BDBM25978
Meas. Tech.
Fluorescence Polarization Assay
pH
7.5±n/a
Temperature
295.15±n/a K
Ki
1600±n/a nM
IC50
10000±n/a nM
Citation
 Angell, RMBamborough, PCleasby, ACockerill, SGJones, KLMooney, CJSomers, DOWalker, AL Biphenyl amide p38 kinase inhibitors 1: Discovery and binding mode. Bioorg Med Chem Lett 18:318-23 (2008)  
Target
Name:
Mitogen-activated protein kinase 14
Synonyms:
CSAID-binding protein CSBP1 CSPB1 MAP kinase 14 MAP kinase p38 alpha MAPK14 MK14_HUMAN Mitogen-activated protein kinase p38 alpha Stress-activated protein kinase 2a | p38 MAP kinase alpha/beta
Type:
Serine/threonine-protein kinase
Mol. Mass.:
41286.76
Organism:
Homo sapiens (Human)
Description:
Q16539
Residue:
360
  
Inhibitor
Name:
BDBM25979
Synonyms:
BMCL18324 Compound 1 biphenyl amide, 2
Type:
Small organic molecule
Emp. Form.:
C29H31N5O3
Mol. Mass.:
497.5881
SMILES:
COc1ccc(NC(=O)c2ccc(cc2)-c2cc(ccc2C)-c2nnc(C)o2)cc1N1CCN(C)CC1
:
Substrate
Name:
BDBM25978
Synonyms:
2-(6-amino-3-imino-3H-xanthen-9-yl)-5-[({4-[4-(4-chloro-3-hydroxyphenyl)-5-(pyridin-4-yl)-1H-imidazol-2-yl]phenyl}methyl)carbamoyl]benzoic acid Rhodamine-green Labelled Fluoroligand
Type:
fluorescent ligand
Emp. Form.:
C42H29ClN6O5
Mol. Mass.:
733.17
SMILES:
Nc1ccc2c(-c3ccc(cc3C(O)=O)C(=O)NCc3ccc(cc3)-c3nc(c([nH]3)-c3ccc(Cl)c(O)c3)-c3ccncc3)c3ccc(=N)cc3oc2c1
: