Target
Proto-oncogene tyrosine-protein kinase LCK
Ligand
BDBM25191
Substrate
Biotinylated Peptide Substrate
Meas. Tech.
Time Resolved Fluorescence Resonance Energy Transfer Assay
pH
7.4±n/a
Temperature
295.15±n/a K
Ki
20±n/a nM
IC50
59±n/a nM
Citation
 Angell, RMBamborough, PCleasby, ACockerill, SGJones, KLMooney, CJSomers, DOWalker, AL Biphenyl amide p38 kinase inhibitors 1: Discovery and binding mode. Bioorg Med Chem Lett 18:318-23 (2008)  
Target
Name:
Proto-oncogene tyrosine-protein kinase LCK
Synonyms:
LCK_MOUSE Lck Lymphocyte cell-specific protein-tyrosine kinase Tyrosine-protein kinase LCK | p56-LCK
Type:
PROTEIN
Mol. Mass.:
57927.84
Organism:
Mus musculus
Description:
ChEMBL_806408
Residue:
509
  
Inhibitor
Name:
BDBM25191
Synonyms:
4-{4-[(5-hydroxy-2-methylphenyl)amino]quinolin-7-yl}-1,3-thiazole-2-carbaldehyde BMCL174363 Compound 1 | BMCL18318 Compound 1
Type:
Small organic molecule
Emp. Form.:
C20H15N3O2S
Mol. Mass.:
361.417
SMILES:
Cc1ccc(O)cc1Nc1ccnc2cc(ccc12)-c1csc(C=O)n1
:
Substrate
Name:
Biotinylated Peptide Substrate
Synonyms:
Type:
Peptide
Mol. Mass.:
1622.70
Organism:
Description:
Residue:
13
ITINEEEEYFELV