Target
RAF proto-oncogene serine/threonine-protein kinase
Ligand
BDBM26035
Substrate
MEK Inactive Mutant
Meas. Tech.
RAF Kinase Inhibition Assay
IC50
14±n/a nM
Citation
 Ramurthy, SSubramanian, SAikawa, MAmiri, PCostales, ADove, JFong, SJansen, JMLevine, BMa, SMcBride, CMMichaelian, JPick, TPoon, DJGirish, SShafer, CMStuart, DSung, LRenhowe, PA Design and Synthesis of Orally Bioavailable Benzimidazoles as Raf Kinase Inhibitors. J Med Chem 51:7049-52 (2008)  
Target
Name:
RAF proto-oncogene serine/threonine-protein kinase
Synonyms:
C-Raf Protein Kinase RAF RAF1 Raf-1 Serine/threonine-protein kinase C-Raf | cRaf
Type:
Serine/threonine-protein kinase
Mol. Mass.:
73082.52
Organism:
Homo sapiens (Human)
Description:
P04049
Residue:
648
  
Inhibitor
Name:
BDBM26035
Synonyms:
4-({2-[(4-bromophenyl)amino]-1-methyl-1H-1,3-benzodiazol-5-yl}oxy)-N-ethylpyridine-2-carboxamide | arylaminobenzimidazole, 30
Type:
Small organic molecule
Emp. Form.:
C22H20BrN5O2
Mol. Mass.:
466.331
SMILES:
CCNC(=O)c1cc(Oc2ccc3n(C)c(Nc4ccc(Br)cc4)nc3c2)ccn1
:
Substrate
Name:
MEK Inactive Mutant
Synonyms:
Full length kinase dead MEK | kd-MEK
Type:
Other Protein Type
Mol. Mass.:
358.43
Organism:
Description:
Residue:
3
NA