Target
Proto-oncogene tyrosine-protein kinase LCK
Ligand
BDBM26182
Substrate
Biotinylated Peptide Substrate
Meas. Tech.
Time Resolved Fluorescence Resonance Energy Transfer Assay
IC50
55±n/a nM
Citation
 Bamborough, PAngell, RMBhamra, IBrown, DBull, JChristopher, JACooper, AWFazal, LHGiordano, IHind, LPatel, VKRanshaw, LESims, MJSkone, PASmith, KJVickerstaff, EWashington, M N-4-Pyrimidinyl-1H-indazol-4-amine inhibitors of Lck: indazoles as phenol isosteres with improved pharmacokinetics. Bioorg Med Chem Lett 17:4363-8 (2007)  
Target
Name:
Proto-oncogene tyrosine-protein kinase LCK
Synonyms:
LCK_MOUSE Lck Lymphocyte cell-specific protein-tyrosine kinase Tyrosine-protein kinase LCK | p56-LCK
Type:
PROTEIN
Mol. Mass.:
57927.84
Organism:
Mus musculus
Description:
ChEMBL_806408
Residue:
509
  
Inhibitor
Name:
BDBM26182
Synonyms:
2,4-dianilino pyrimidine, 39 | 3-({4-[(7-methyl-1H-indazol-4-yl)amino]pyrimidin-2-yl}amino)benzamide
Type:
Small organic molecule
Emp. Form.:
C19H17N7O
Mol. Mass.:
359.3846
SMILES:
Cc1ccc(Nc2ccnc(Nc3cccc(c3)C(N)=O)n2)c2cn[nH]c12
:
Substrate
Name:
Biotinylated Peptide Substrate
Synonyms:
Type:
Peptide
Mol. Mass.:
1622.70
Organism:
Description:
Residue:
13
ITINEEEEYFELV