Target
Gamma-aminobutyric acid receptor subunit alpha-1 [28-456]/beta-2 [26-512]/gamma-2 [40-200],P14867[176-456]
Ligand
BDBM26263
Substrate
BDBM26263
Meas. Tech.
Radioligand Binding Assay
Temperature
298.15±n/a K
Ki
9.6±n/a nM
Comments
extracted
Citation
 Hanson, SMMorlock, EVSatyshur, KACzajkowski, C Structural Requirements for Eszopiclone and Zolpidem Binding to the gamma-Aminobutyric Acid Type-A (GABAA) Receptor Are Different. J Med Chem 51:7243-52 (2008)  
Target
Name:
Gamma-aminobutyric acid receptor subunit alpha-1 [28-456]/beta-2 [26-512]/gamma-2 [40-200],P14867[176-456]
Synonyms:
GABAA Receptor Mutant, alpha-1, beta-2, gamma-2 (Chimera)
Type:
Protein Complex
Mol. Mass.:
Description:
It is expressed with WT alpha-1, beta-2, and a chimeric subunit containing residues up to gamma-2 amino acid 161, and alpha-1 residues C-terminal to 161.
Components:
This complex has 3 components.
Component 1
Name:
Gamma-aminobutyric acid receptor subunit beta-2 [26-512]
Synonyms:
GABA(A) receptor subunit beta-2 GABRB2 Gamma-aminobutyric acid receptor subunit beta-2
Type:
Ionic channel
Mol. Mass.:
56212.32
Organism:
Homo sapiens (Human)
Description:
P47870[26-512]
Residue:
487
  
Component 2
Name:
Gamma-aminobutyric acid receptor subunit alpha-1 [28-456]
Synonyms:
GABA(A) receptor subunit alpha-1 GABRA1 Gamma-aminobutyric acid receptor subunit alpha-1
Type:
Ionic channel
Mol. Mass.:
48807.81
Organism:
Homo sapiens (Human)
Description:
P14867[28-456]
Residue:
429
  
Component 3
Name:
Gamma-aminobutyric acid receptor subunit gamma-2 [40-200],P14867[176-456]
Synonyms:
Complex of Gamma-aminobutyric acid receptor subunit gamma-2 [40-200] and Gamma-aminobutyric acid receptor subunit alpha-1 [176-456] GABA(A) receptor subunit gamma-2 mutant (gamma-2 D161/alpha-1 A149) | GABAA Receptor Subunit gamma-2 Mutant (Chimera)
Type:
Ionic channel
Mol. Mass.:
50363.91
Organism:
Homo sapiens (Human)
Description:
P18507[40-200],P14867[176-456]
Residue:
442
  
Inhibitor
Name:
BDBM26263
Synonyms:
Anexate FLUMAZENIL Romazicon ethyl 12-fluoro-8-methyl-9-oxo-2,4,8-triazatricyclo[8.4.0.0^{2,6}]tetradeca-1(14),3,5,10,12-pentaene-5-carboxylate
Type:
Small organic molecule
Emp. Form.:
C15H14FN3O3
Mol. Mass.:
303.2884
SMILES:
CCOC(=O)c1ncn-2c1CN(C)C(=O)c1cc(F)ccc-21
:
Substrate
Name:
BDBM26263
Synonyms:
Anexate FLUMAZENIL Romazicon ethyl 12-fluoro-8-methyl-9-oxo-2,4,8-triazatricyclo[8.4.0.0^{2,6}]tetradeca-1(14),3,5,10,12-pentaene-5-carboxylate
Type:
Small organic molecule
Emp. Form.:
C15H14FN3O3
Mol. Mass.:
303.2884
SMILES:
CCOC(=O)c1ncn-2c1CN(C)C(=O)c1cc(F)ccc-21
: