Target
Proline-rich AKT1 substrate 1
Ligand
BDBM385992
Substrate
Meas. Tech.
AKT Enzyme Assay
IC50
300±n/a nM
Citation
 Lan, RHuck, BRChen, XXiao, Y Heterocyclic derivatives as modulators of kinase activity US Patent  US10287300 Publication Date 5/14/2019 
Target
Name:
Proline-rich AKT1 substrate 1
Synonyms:
40 kDa proline-rich AKT substrate AKTS1_HUMAN | PRAS40
Type:
PROTEIN
Mol. Mass.:
27368.40
Organism:
Homo sapiens (Human)
Description:
ChEMBL_664853
Residue:
256
  
Inhibitor
Name:
BDBM385992
Synonyms:
2-(1-(5,6,7,8-tetrahydro-1,8-naphthyridin-4-yl)piperidin-4-yl)-2-(4-(trifluoromethyl)phenyl)ethanamine | US10287300, Compound A1
Type:
Small organic molecule
Emp. Form.:
C22H27F3N4
Mol. Mass.:
404.4718
SMILES:
NCC(C1CCN(CC1)c1ccnc2NCCCc12)c1ccc(cc1)C(F)(F)F
: