Target
Proline-rich AKT1 substrate 1
Ligand
BDBM385994
Substrate
Meas. Tech.
AKT Enzyme Assay
IC50
>1000±n/a nM
Citation
 Lan, RHuck, BRChen, XXiao, Y Heterocyclic derivatives as modulators of kinase activity US Patent  US10287300 Publication Date 5/14/2019 
Target
Name:
Proline-rich AKT1 substrate 1
Synonyms:
40 kDa proline-rich AKT substrate AKTS1_HUMAN | PRAS40
Type:
PROTEIN
Mol. Mass.:
27368.40
Organism:
Homo sapiens (Human)
Description:
ChEMBL_664853
Residue:
256
  
Inhibitor
Name:
BDBM385994
Synonyms:
2-(1-(6,7-dihydro-5H-cyclopenta[b]pyrimidin-4-yl)piperazin-4-yl)-2-(4-(trifluoromethyl)phenyl)ethanamine | US10287300, Compound A3
Type:
Small organic molecule
Emp. Form.:
C20H24F3N5
Mol. Mass.:
391.4333
SMILES:
NCC(N1CCN(CC1)c1ncnc2CCCc12)c1ccc(cc1)C(F)(F)F
: