Target
Proline-rich AKT1 substrate 1
Ligand
BDBM385998
Substrate
Meas. Tech.
AKT Enzyme Assay
IC50
300±n/a nM
Citation
 Lan, RHuck, BRChen, XXiao, Y Heterocyclic derivatives as modulators of kinase activity US Patent  US10287300 Publication Date 5/14/2019 
Target
Name:
Proline-rich AKT1 substrate 1
Synonyms:
40 kDa proline-rich AKT substrate AKTS1_HUMAN | PRAS40
Type:
PROTEIN
Mol. Mass.:
27368.40
Organism:
Homo sapiens (Human)
Description:
ChEMBL_664853
Residue:
256
  
Inhibitor
Name:
BDBM385998
Synonyms:
US10287300, Compound A5 | [2-[4-(7,8-Dihydro-6H-pyrimido[5,4-b][1,4]oxazin-4-yl)-piperazin-1-yl]-2-(4-trifluoromethylphenyl)-ethyl]-dimethylamine
Type:
Small organic molecule
Emp. Form.:
C21H27F3N6O
Mol. Mass.:
436.4739
SMILES:
CN(C)CC(N1CCN(CC1)c1ncnc2NCCOc12)c1ccc(cc1)C(F)(F)F
: