Target
Proline-rich AKT1 substrate 1
Ligand
BDBM386008
Substrate
Meas. Tech.
AKT Enzyme Assay
IC50
750±n/a nM
Citation
 Lan, RHuck, BRChen, XXiao, Y Heterocyclic derivatives as modulators of kinase activity US Patent  US10287300 Publication Date 5/14/2019 
Target
Name:
Proline-rich AKT1 substrate 1
Synonyms:
40 kDa proline-rich AKT substrate AKTS1_HUMAN | PRAS40
Type:
PROTEIN
Mol. Mass.:
27368.40
Organism:
Homo sapiens (Human)
Description:
ChEMBL_664853
Residue:
256
  
Inhibitor
Name:
BDBM386008
Synonyms:
2-[4-(6,7-Dihydro-5H-pyrrolo[2,3-d]pyrimidin-4-yl)-piperazin-1-yl]-2-(4-fluorophenyl)-ethylamine | US10287300, Compound A14
Type:
Small organic molecule
Emp. Form.:
C18H23FN6
Mol. Mass.:
342.4138
SMILES:
NCC(N1CCN(CC1)c1ncnc2NCCc12)c1ccc(F)cc1
: