Target
Proline-rich AKT1 substrate 1
Ligand
BDBM386021
Substrate
Meas. Tech.
AKT Enzyme Assay
IC50
>1000±n/a nM
Citation
 Lan, RHuck, BRChen, XXiao, Y Heterocyclic derivatives as modulators of kinase activity US Patent  US10287300 Publication Date 5/14/2019 
Target
Name:
Proline-rich AKT1 substrate 1
Synonyms:
40 kDa proline-rich AKT substrate AKTS1_HUMAN | PRAS40
Type:
PROTEIN
Mol. Mass.:
27368.40
Organism:
Homo sapiens (Human)
Description:
ChEMBL_664853
Residue:
256
  
Inhibitor
Name:
BDBM386021
Synonyms:
4-{4-[2-dimethylamino-1-(3-chloro-phenyl)-ethyl]-piperazin-1-yl}-7,8-dihydro-5H-pteridin-6-one | US10287300, Compound A27
Type:
Small organic molecule
Emp. Form.:
C20H26ClN7O
Mol. Mass.:
415.92
SMILES:
CN(C)CC(N1CCN(CC1)c1ncnc2NCC(=O)Nc12)c1cccc(Cl)c1
: