Target
Proline-rich AKT1 substrate 1
Ligand
BDBM386025
Substrate
Meas. Tech.
AKT Enzyme Assay
IC50
>1000±n/a nM
Citation
 Lan, RHuck, BRChen, XXiao, Y Heterocyclic derivatives as modulators of kinase activity US Patent  US10287300 Publication Date 5/14/2019 
Target
Name:
Proline-rich AKT1 substrate 1
Synonyms:
40 kDa proline-rich AKT substrate AKTS1_HUMAN | PRAS40
Type:
PROTEIN
Mol. Mass.:
27368.40
Organism:
Homo sapiens (Human)
Description:
ChEMBL_664853
Residue:
256
  
Inhibitor
Name:
BDBM386025
Synonyms:
4-{4-[1-(4-fluoro-phenyl)-2-(piperidin-yl)-ethyl]-piperazin-1-yl}-7,8-dihydro-5H-pteridin-6-one | US10287300, Compound A31
Type:
Small organic molecule
Emp. Form.:
C23H30FN7O
Mol. Mass.:
439.529
SMILES:
Fc1ccc(cc1)C(CN1CCCCC1)N1CCN(CC1)c1ncnc2NCC(=O)Nc12
: