Target
Proline-rich AKT1 substrate 1
Ligand
BDBM386029
Substrate
Meas. Tech.
AKT Enzyme Assay
IC50
>1000±n/a nM
Citation
 Lan, RHuck, BRChen, XXiao, Y Heterocyclic derivatives as modulators of kinase activity US Patent  US10287300 Publication Date 5/14/2019 
Target
Name:
Proline-rich AKT1 substrate 1
Synonyms:
40 kDa proline-rich AKT substrate AKTS1_HUMAN | PRAS40
Type:
PROTEIN
Mol. Mass.:
27368.40
Organism:
Homo sapiens (Human)
Description:
ChEMBL_664853
Residue:
256
  
Inhibitor
Name:
BDBM386029
Synonyms:
4-{4-[2-Pyrrolidin-1-yl-1-(4-trifluoromethyl-phenyl)-ethyl]-piperazin-1-yl}-7,8-dihydro-5H-pteridin-6-one | US10287300, Compound A34
Type:
Small organic molecule
Emp. Form.:
C23H28F3N7O
Mol. Mass.:
475.5099
SMILES:
FC(F)(F)c1ccc(cc1)C(CN1CCCC1)N1CCN(CC1)c1ncnc2NCC(=O)Nc12
: