Target
Aurora kinase B
Ligand
BDBM26308
Substrate
Biotinylated Peptide Substrate
Meas. Tech.
Aurora B Kinase Inhibition Assay
pH
7.5±n/a
Temperature
295.15±n/a K
Ki
<1±n/a nM
Citation
 Foote, KMMortlock, AAHeron, NMJung, FHHill, GBPasquet, GBrady, MCGreen, SHeaton, SPKearney, SKeen, NJOdedra, RWedge, SRWilkinson, RW Synthesis and SAR of 1-acetanilide-4-aminopyrazole-substituted quinazolines: selective inhibitors of Aurora B kinase with potent anti-tumor activity. Bioorg Med Chem Lett 18:1904-9 (2008)  
Target
Name:
Aurora kinase B
Synonyms:
AIK2 AIM1 ARK2 AURKB_HUMAN Aurora B-INCENP Aurora kinase B (AURKB) STK-1 STK12 Serine/threonine-protein kinase aurora B
Type:
Protein
Mol. Mass.:
39327.72
Organism:
Homo sapiens (Human)
Description:
Q96GD4
Residue:
344
  
Inhibitor
Name:
BDBM26308
Synonyms:
4-aminopyrazole quinazoline, 8 | N-(2,3-difluorophenyl)-2-{4-[(7-{3-[(2R)-2-(hydroxymethyl)pyrrolidin-1-yl]propoxy}quinazolin-4-yl)amino]-1H-pyrazol-1-yl}acetamide
Type:
Small organic molecule
Emp. Form.:
C27H29F2N7O3
Mol. Mass.:
537.5611
SMILES:
OC[C@H]1CCCN1CCCOc1ccc2c(Nc3cnn(CC(=O)Nc4cccc(F)c4F)c3)ncnc2c1
:
Substrate
Name:
Biotinylated Peptide Substrate
Synonyms:
Type:
Peptide
Mol. Mass.:
2374.22
Organism:
Description:
Residue:
20