Target
Store-operated calcium entry-associated regulatory factor
Ligand
BDBM387313
Substrate
Meas. Tech.
SOCE inhibition
IC50
<1000±n/a nM
Citation
 Irlapati, NRDeshmukh, GKKarche, VPJachak, SMSinha, NPalle, VPKamboj, RK Oxazoline and isoxazoline derivatives as CRAC modulators US Patent  US10292981 Publication Date 5/21/2019 
Target
Name:
Store-operated calcium entry-associated regulatory factor
Synonyms:
HBV X-transactivated gene 3 protein Protein FOAP-7 SOCE-associated regulatory factor Transmembrane protein 66 | XTP3
Type:
Enzyme Catalytic Domain
Mol. Mass.:
36978.81
Organism:
Homo sapiens (Human)
Description:
Q96BY9
Residue:
339
  
Inhibitor
Name:
BDBM387313
Synonyms:
N-(5′- (5,5-dimethyl-4-oxo- 4,5-dihydroisoxazol- 3-yl)-2′-methoxy- [1,1′-biphenyl]-4-yl)- 2,6- difluorobenzamide | US10292981, Example 15
Type:
Small organic molecule
Emp. Form.:
C25H20F2N2O4
Mol. Mass.:
450.4341
SMILES:
COc1ccc(cc1-c1ccc(NC(=O)c2c(F)cccc2F)cc1)C1=NOC(C)(C)C1=O
: