Target
Serine/threonine-protein kinase pim-1
Ligand
BDBM7459
Substrate
GST-BAD
Meas. Tech.
Solid-Phase ELISA Kinase Assay
pH
7±n/a
Temperature
303.15±n/a K
IC50
1600±n/a nM
Citation
 Holder, SZemskova, MZhang, CTabrizizad, MBremer, RNeidigh, JWLilly, MB Characterization of a potent and selective small-molecule inhibitor of the PIM1 kinase. Mol Cancer Ther 6:163-72 (2007)  
Target
Name:
Serine/threonine-protein kinase pim-1
Synonyms:
PIM-1 Kinase PIM1_HUMAN Serine/threonine-protein kinase (PIM1) Serine/threonine-protein kinase PIM1 | Serine/threonine-protein kinase pim-1 (PIM1)
Type:
Protein
Mol. Mass.:
35681.82
Organism:
Homo sapiens (Human)
Description:
P11309
Residue:
313
  
Inhibitor
Name:
BDBM7459
Synonyms:
2-(3,4-dihydroxyphenyl)-5,7-dihydroxy-4H-chromen-4-one CHEMBL151 Luteolin (4) cid_5280445 med.21724, Compound 3
Type:
Small organic molecule
Emp. Form.:
C15H10O6
Mol. Mass.:
286.2363
SMILES:
Oc1cc(O)c2c(c1)oc(cc2=O)-c1ccc(O)c(O)c1
:
Substrate
Name:
Bcl2-associated agonist of cell death
Synonyms:
BAD_MOUSE Bbc6 GST-BAD
Type:
Other Protein Type
Mol. Mass.:
22084.58
Organism:
Mus musculus (mouse)
Description:
Residue:
204