Target
Serine/threonine-protein kinase pim-1
Ligand
BDBM26668
Substrate
S6 Peptide Substrate
Meas. Tech.
Kinase Inhibition Assay
pH
7.6±n/a
Temperature
303.15±n/a K
Ki
11±n/a nM
Citation
 Pierce, ACJacobs, MStuver-Moody, C Docking study yields four novel inhibitors of the protooncogene Pim-1 kinase. J Med Chem 51:1972-5 (2008)  
Target
Name:
Serine/threonine-protein kinase pim-1
Synonyms:
PIM-1 Kinase PIM1_HUMAN Serine/threonine-protein kinase (PIM1) Serine/threonine-protein kinase PIM1 | Serine/threonine-protein kinase pim-1 (PIM1)
Type:
Protein
Mol. Mass.:
35681.82
Organism:
Homo sapiens (Human)
Description:
P11309
Residue:
313
  
Inhibitor
Name:
BDBM26668
Synonyms:
CHEMBL494360 triazolopyridazine compound, 1
Type:
Small organic molecule
Emp. Form.:
C18H18F3N5
Mol. Mass.:
361.3642
SMILES:
FC(F)(F)c1cccc(c1)-c1nnc2ccc(NC3CCCCC3)nn12
:
Substrate
Name:
S6 Peptide Substrate
Synonyms:
Type:
Peptide
Mol. Mass.:
1118.34
Organism:
Description:
Residue:
9
RRRLSSLRA