Target
Sodium channel protein type 5 subunit alpha
Ligand
BDBM263959
Substrate
Meas. Tech.
Electrophysiological Assay (EP) (In vitro Assay)
pH
7.2±n/a
IC50
623±n/a nM
Comments
extracted
Citation
 Andrez, JBichler, PRChen, CChowdhury, SDecker, SMDehnhardt, CMFocken, TGrimwood, MEHemeon, IWJia, QLi, JLiu, ZOrtwine, DFSafina, BSutherlin, DSheng, TSun, SWhite, ADWilson, MSZenova, AYZhu, J Substituted benzamides and methods of use thereof US Patent  US9546164 Publication Date 1/17/2017 
Target
Name:
Sodium channel protein type 5 subunit alpha
Synonyms:
HH1 SCN5A_HUMAN Sodium channel protein type 5 subunit alpha/beta-1/beta-2 Voltage-gated sodium channel subunit alpha Nav1.5
Type:
Enzyme
Mol. Mass.:
226908.60
Organism:
Homo sapiens (Human)
Description:
Q14524
Residue:
2016
  
Inhibitor
Name:
BDBM263959
Synonyms:
5-Cyclopropyl-4-((1-(3,5-dichloro-2-cyanobenzyl)piperidin-4-yl)methoxy)-2-fluoro-N-(methylsulfonyl)benzamide | US9546164, 594
Type:
Small organic molecule
Emp. Form.:
C25H26Cl2FN3O4S
Mol. Mass.:
554.461
SMILES:
CS(=O)(=O)NC(=O)c1cc(C2CC2)c(OCC2CCN(Cc3cc(Cl)cc(Cl)c3C#N)CC2)cc1F
: