Target
Amine oxidase [flavin-containing] B
Ligand
BDBM256462
Substrate
Meas. Tech.
Biological Assay
Ki
5500±n/a nM
Citation
 Ortega Muñoz, AFyfe, MCMartinell Pedemonte, MEstiarte Martinez, MValls Vidal, NKurz, GCastro Palomino Laria, JC (Hetero)aryl cyclopropylamine compounds as LSD1 inhibitors US Patent  US9944601 Publication Date 4/17/2018 
Target
Name:
Amine oxidase [flavin-containing] B
Synonyms:
AOFB_HUMAN MAOB Monoamine oxidase type B (MAO B) Monoamine oxidase type B (MAOB)
Type:
Protein
Mol. Mass.:
58768.76
Organism:
Homo sapiens (Human)
Description:
P27338
Residue:
520
  
Inhibitor
Name:
BDBM256462
Synonyms:
US10329256, Example 7 US9944601, Example 7
Type:
Small organic molecule
Emp. Form.:
C20H21F3N2O
Mol. Mass.:
362.3887
SMILES:
FC(F)(F)c1cccc(c1)-c1ccc(cn1)[C@H]1C[C@@H]1NC1CCOCC1
: