Target
Amine oxidase [flavin-containing] A
Ligand
BDBM256464
Substrate
Meas. Tech.
Biological Assay
Ki
55000±n/a nM
Citation
 Ortega Muñoz, AFyfe, MCMartinell Pedemonte, MEstiarte Martinez, MValls Vidal, NKurz, GCastro Palomino Laria, JC (Hetero)aryl cyclopropylamine compounds as LSD1 inhibitors US Patent  US9944601 Publication Date 4/17/2018 
Target
Name:
Amine oxidase [flavin-containing] A
Synonyms:
AOFA_HUMAN MAO-A Monoamine oxidase Monoamine oxidase type A (MAO A) Monoamine oxidase type A (MAOA)
Type:
Protein
Mol. Mass.:
59689.53
Organism:
Homo sapiens (Human)
Description:
P21397
Residue:
527
  
Inhibitor
Name:
BDBM256464
Synonyms:
US10329256, Example 9 US9944601, Example 9
Type:
Small organic molecule
Emp. Form.:
C22H26ClNO
Mol. Mass.:
355.901
SMILES:
Clc1ccc(cc1)-c1ccc(cc1)[C@H]1C[C@@H]1NCCC1CCOCC1
: