Target
Lysine-specific histone demethylase 1A
Ligand
BDBM256484
Substrate
Meas. Tech.
Biological Assay
IC50
23.0±n/a nM
Citation
 Ortega Muñoz, AFyfe, MCMartinell Pedemonte, MEstiarte Martinez, MValls Vidal, NKurz, GCastro Palomino Laria, JC (Hetero)aryl cyclopropylamine compounds as LSD1 inhibitors US Patent  US9944601 Publication Date 4/17/2018 
Target
Name:
Lysine-specific histone demethylase 1A
Synonyms:
AOF2 Flavin-containing amine oxidase domain-containing protein 2 KDM1A KIAA0601 Lysine-specific demethylase 1 (LSD1) Lysine-specific histone demethylase 1 (LSD1)
Type:
Enzyme
Mol. Mass.:
92901.01
Organism:
Homo sapiens (Human)
Description:
O60341
Residue:
852
  
Inhibitor
Name:
BDBM256484
Synonyms:
US10329256, Example 29 US9944601, Example 29
Type:
Small organic molecule
Emp. Form.:
C22H29N3O3S
Mol. Mass.:
415.549
SMILES:
COc1ccc(NS(C)(=O)=O)cc1-c1ccc(cc1)[C@H]1C[C@@H]1NC1CCNCC1
: