Target
Lysine-specific histone demethylase 1A
Ligand
BDBM256491
Substrate
Meas. Tech.
Biological Assay
IC50
68.0±n/a nM
Citation
 Ortega Muñoz, AFyfe, MCMartinell Pedemonte, MEstiarte Martinez, MValls Vidal, NKurz, GCastro Palomino Laria, JC (Hetero)aryl cyclopropylamine compounds as LSD1 inhibitors US Patent  US9944601 Publication Date 4/17/2018 
Target
Name:
Lysine-specific histone demethylase 1A
Synonyms:
AOF2 Flavin-containing amine oxidase domain-containing protein 2 KDM1A KIAA0601 Lysine-specific demethylase 1 (LSD1) Lysine-specific histone demethylase 1 (LSD1)
Type:
Enzyme
Mol. Mass.:
92901.01
Organism:
Homo sapiens (Human)
Description:
O60341
Residue:
852
  
Inhibitor
Name:
BDBM256491
Synonyms:
US10329256, Example 36 US9944601, Example 36
Type:
Small organic molecule
Emp. Form.:
C18H28N2
Mol. Mass.:
272.4283
SMILES:
CC1(C)CC(CC(C)(C)N1)N[C@H]1C[C@@H]1c1ccccc1
: