Target
Carbonic anhydrase 4
Ligand
BDBM26983
Substrate
BDBM10856
Meas. Tech.
CA Inhibition Assay
Ki
39000000±n/a nM
Citation
 Innocenti, AHilvo, MParkkila, SScozzafava, ASupuran, CT Carbonic anhydrase inhibitors: the membrane-associated isoform XV is highly inhibited by inorganic anions. Bioorg Med Chem Lett 19:1155-8 (2009)  
Target
Name:
Carbonic anhydrase 4
Synonyms:
CA-IV CAH4_HUMAN Carbonic anhydrase Carbonic anhydrase IV (CA IV)
Type:
Enzyme
Mol. Mass.:
35037.98
Organism:
Homo sapiens (Human)
Description:
P22748
Residue:
312
  
Inhibitor
Name:
BDBM26983
Synonyms:
CHEMBL1644028 Thiocyanate sodium thiocyanate
Type:
Ion
Emp. Form.:
CNS
Mol. Mass.:
58.083
SMILES:
[N-]=C=S
:
Substrate
Name:
BDBM10856
Synonyms:
Carbon Dioxide | methanedione
Type:
Small organic molecule
Emp. Form.:
CO2
Mol. Mass.:
44.0095
SMILES:
O=C=O
: