Target
Carbonic anhydrase 6
Ligand
BDBM10873
Substrate
BDBM10856
Meas. Tech.
CA Inhibition Assay
Ki
86±n/a nM
Citation
 Hilvo, MSalzano, AMInnocenti, AKulomaa, MSScozzafava, AScaloni, AParkkila, SSupuran, CT Cloning, expression, post-translational modifications and inhibition studies on the latest mammalian carbonic anhydrase isoform, CA XV. J Med Chem 52:646-54 (2009)  
Target
Name:
Carbonic anhydrase 6
Synonyms:
CA-VI CAH6_HUMAN Carbonic Anhydrase VI Carbonic anhydrase 6 Carbonic anhydrase 6 (CA-VI) Salivary carbonic anhydrase | Secreted carbonic anhydrase
Type:
Enzyme
Mol. Mass.:
35371.40
Organism:
Homo sapiens (Human)
Description:
P23280
Residue:
308
  
Inhibitor
Name:
BDBM10873
Synonyms:
4-[(2-aminopyrimidin-4-yl)amino]benzene-1-sulfonamide US9616064, Compound 1aa | aromatic/heteroaromatic sulfonamide 18
Type:
Small organic molecule
Emp. Form.:
C10H11N5O2S
Mol. Mass.:
265.292
SMILES:
Nc1nccc(Nc2ccc(cc2)S(N)(=O)=O)n1
:
Substrate
Name:
BDBM10856
Synonyms:
Carbon Dioxide | methanedione
Type:
Small organic molecule
Emp. Form.:
CO2
Mol. Mass.:
44.0095
SMILES:
O=C=O
: