Target
Indoleamine 2,3-dioxygenase 1
Ligand
BDBM312080
Substrate
Meas. Tech.
Enzymatic Activity Assay
IC50
1800±n/a nM
Citation
 Crosignani, SCauwenberghs, SDriessens, GDeroose, F Pyrrolidine-2, 5-dione derivatives, pharmaceutical compositions and methods for use as IDO1 inhibitors US Patent  US9949951 Publication Date 4/24/2018 
Target
Name:
Indoleamine 2,3-dioxygenase 1
Synonyms:
I23O1_HUMAN IDO-1 INDO Indoleamine 2,3-dioxygenase | Indoleamine-pyrrole 2,3-dioxygenase
Type:
Enzyme
Mol. Mass.:
45330.80
Organism:
Homo sapiens (Human)
Description:
P14902
Residue:
403
  
Inhibitor
Name:
BDBM312080
Synonyms:
3-(5,6-difluoro-1H- indol-3-yl)pyrrolidine- 2,5-dione US9949951, 15
Type:
Small organic molecule
Emp. Form.:
C12H8F2N2O2
Mol. Mass.:
250.2009
SMILES:
Fc1cc2[nH]cc(C3CC(=O)NC3=O)c2cc1F
: