Target
Indoleamine 2,3-dioxygenase 1
Ligand
BDBM312084
Substrate
Meas. Tech.
Enzymatic Activity Assay
IC50
420±n/a nM
Citation
 Crosignani, SCauwenberghs, SDriessens, GDeroose, F Pyrrolidine-2, 5-dione derivatives, pharmaceutical compositions and methods for use as IDO1 inhibitors US Patent  US9949951 Publication Date 4/24/2018 
Target
Name:
Indoleamine 2,3-dioxygenase 1
Synonyms:
I23O1_HUMAN IDO-1 INDO Indoleamine 2,3-dioxygenase | Indoleamine-pyrrole 2,3-dioxygenase
Type:
Enzyme
Mol. Mass.:
45330.80
Organism:
Homo sapiens (Human)
Description:
P14902
Residue:
403
  
Inhibitor
Name:
BDBM312084
Synonyms:
3-(6-bromo-1H-indol-3- yl)pyrrolidine-2,5-dione US9949951, 19
Type:
Small organic molecule
Emp. Form.:
C12H9BrN2O2
Mol. Mass.:
293.116
SMILES:
Brc1ccc2c(c[nH]c2c1)C1CC(=O)NC1=O
: